Reaction Details
TargetHypoxanthine-guanine phosphoribosyltransferase
LigandBDBM50392264
Substrate/Competitorn/a
Meas. Tech.ChEMBL_850551 (CHEMBL2157773)
Ki 1400±n/a nM
Citation Hocková, DKeough, DTJaneba, ZWang, THde Jersey, JGuddat, LW Synthesis of novel N-branched acyclic nucleoside phosphonates as potent and selective inhibitors of human, Plasmodium falciparum and Plasmodium vivax 6-oxopurine phosphoribosyltransferases. J Med Chem55:6209-23 (2012) 
 
Hypoxanthine-guanine phosphoribosyltransferase
Name:Hypoxanthine-guanine phosphoribosyltransferase
Type:Protein
Mol. Mass.:24579.61
Organism:Homo sapiens (Human)
Description:P00492
Residue:218
BDBM50392264
NameBDBM50392264
Synonyms:CHEMBL2153482
TypeSmall organic molecule
Emp. Form.C11H17N6O6P
Mol. Mass.360.263
SMILESNc1nc2n(CCN(CCP(O)(O)=O)CC(O)=O)cnc2c(=O)[nH]1