Reaction Details
TargetTopoisomerase I subunit B
LigandBDBM50008923
Substrate/Competitorn/a
Meas. Tech.ChEMBL_851293 (CHEMBL2155879)
EC50 670±n/a nM
Citation Carballeira, NMCartagena, MSanabria, DTasdemir, DPrada, CFReguera, RMBalaña-Fouce, R 2-Alkynoic fatty acids inhibit topoisomerase IB from Leishmania donovani. Bioorg Med Chem Lett22:6185-9 (2012) 
 
Topoisomerase I subunit B
Name:Topoisomerase I subunit B
Type:PROTEIN
Mol. Mass.:28099.86
Organism:Leishmania major
Description:ChEMBL_851293
Residue:262
BDBM50008923
NameBDBM50008923
Synonyms:(S)-4-ethyl-4-hydroxy-1,12-dihydro-4H-2-oxa-6,12a-diaza-dibenzo[b,h]florene-3,13-dione 4-Ethyl-4-hydroxy-1,12-dihydro-4H-2-oxa-6,12a-diaza-dibenzo[b,h]fluorene-3,13-dione 4-Ethyl-4-hydroxy-1,12-dihydro-4H-2-oxa-6,12a-diaza-dibenzo[b,h]fluorene-3,13-dione (Camptothecin) 4-ethyl-4-hydroxy-(4S)-3,4,12,14-tetrahydro-1H-pyrano[3',4':6,7]indolizino[1,2-b]quinoline-3,14-dione Camptothecin (CT) cid_24360
TypeSmall organic molecule
Emp. Form.C20H16N2O4
Mol. Mass.348.352
SMILESCC[C@@]1(O)C(=O)OCc2c1cc1-c3nc4ccccc4cc3Cn1c2=O