Reaction Details
TargetAsparagine synthetase [glutamine-hydrolyzing]
LigandBDBM50392271
Substrate/Competitorn/a
Meas. Tech.ChEMBL_851327 (CHEMBL2156034)
Ki 310±n/a nM
Citation Ikeuchi, HAhn, YMOtokawa, TWatanabe, BHegazy, LHiratake, JRichards, NG A sulfoximine-based inhibitor of human asparagine synthetase kills L-asparaginase-resistant leukemia cells. Bioorg Med Chem20:5915-27 (2012) 
 
Asparagine synthetase [glutamine-hydrolyzing]
Name:Asparagine synthetase [glutamine-hydrolyzing]
Type:PROTEIN
Mol. Mass.:64373.20
Organism:Homo sapiens (Human)
Description:ChEMBL_851327
Residue:561
BDBM50392271
NameBDBM50392271
Synonyms:CHEMBL2153508
TypeSmall organic molecule
Emp. Form.C14H21N6O9PS
Mol. Mass.480.39
SMILESCS(=O)(NP(O)(=O)OC[C@H]1O[C@H]([C@H](O)[C@@H]1O)n1cnc2c(N)ncnc12)=CCC(O)=O