Reaction Details
TargetIntegrin alpha-V/beta-5
LigandBDBM50392276
Substrate/Competitorn/a
Meas. Tech.ChEMBL_851468 (CHEMBL2156474)
IC50 2.05±n/a nM
Citation Alloatti, DGiannini, GVesci, LCastorina, MPisano, CBadaloni, ECabri, W Camptothecins in tumor homing via an RGD sequence mimetic. Bioorg Med Chem Lett22:6509-12 (2012) 
 
Integrin alpha-V/beta-5
Name:Integrin alpha-V/beta-5
Type:Enzyme
Mol. Mass.:n/a
Description:n/a
Components:This complex has 2 components.
Component 1
Name:Integrin alpha-V
Synonyms:ITAV_HUMAN Integrin alpha-V/alpha-5 VNRA Vitronectin receptor | Vitronectin receptor subunit alpha
Type:PROTEIN
Mol. Mass.:116024.92
Organism:Homo sapiens (Human)
Description:ChEMBL_582336
Residue:1048
Component 2
Name:Integrin beta-5
Synonyms:ITB5_HUMAN | ITGB5
Type:PROTEIN
Mol. Mass.:88047.37
Organism:Homo sapiens (Human)
Description:EBI_10915
Residue:799
BDBM50392276
NameBDBM50392276
Synonyms:CHEMBL2153644
TypeSmall organic molecule
Emp. Form.C53H56N10O12
Mol. Mass.1025.0715
SMILES[#6]-[#6][C@@]1([#8])[#6](=O)-[#8]-[#6]-c2c1cc1-c3nc4ccc(-[#8]-[#6](=O)-[#7]-5-[#6]-[#6]-[#7](-[#6]-[#6]-5)-[#6](=O)-c5ccc(-[#6]-[#8]-[#6](=O)-[#7]-[#6@@H](-[#6]-[#6]-[#6](=O)-[#7]-6-[#6]-[#6]-[#7](-[#6]-[#6]-6)-c6cccc(c6)\[#7]=[#6]-6/[#7]-[#6]-[#6]-[#6]-[#7]-6)-[#6](-[#8])=O)cc5)cc4cc3-[#6]-n1c2=O