Reaction Details
TargetCannabinoid receptor 1
LigandBDBM50138921
Substrate/Competitorn/a
Meas. Tech.ChEMBL_851480 (CHEMBL2156596)
IC50 100±n/a nM
Citation Chorvat, RJBerbaum, JSeriacki, KMcElroy, JF JD-5006 and JD-5037: peripherally restricted (PR) cannabinoid-1 receptor blockers related to SLV-319 (Ibipinabant) as metabolic disorder therapeutics devoid of CNS liabilities. Bioorg Med Chem Lett22:6173-80 (2012) 
 
Cannabinoid receptor 1
Name:Cannabinoid receptor 1
Type:G Protein-Coupled Receptor (GPCR)
Mol. Mass.:52868.96
Organism:Homo sapiens (Human)
Description:P21554
Residue:472
BDBM50138921
NameBDBM50138921
Synonyms:CHEMBL158138 | N-[1-[3-(4-Chloro-phenyl)-4-phenyl-4,5-dihydro-pyrazol-1-yl]-1-methylamino-meth-(E)-ylidene]-4-methoxy-benzenesulfonamide
TypeSmall organic molecule
Emp. Form.C24H23ClN4O3S
Mol. Mass.482.982
SMILESCOc1ccc(cc1)S(=O)(=O)NC(=NC)N1CC(C(=N1)c1ccc(Cl)cc1)c1ccccc1