Reaction Details
TargetCannabinoid receptor 2
LigandBDBM50392297
Substrate/Competitorn/a
Meas. Tech.ChEMBL_851481 (CHEMBL2156597)
IC50>5000±n/a nM
Citation Chorvat, RJBerbaum, JSeriacki, KMcElroy, JF JD-5006 and JD-5037: peripherally restricted (PR) cannabinoid-1 receptor blockers related to SLV-319 (Ibipinabant) as metabolic disorder therapeutics devoid of CNS liabilities. Bioorg Med Chem Lett22:6173-80 (2012) 
 
Cannabinoid receptor 2
Name:Cannabinoid receptor 2
Type:G Protein-Coupled Receptor (GPCR)
Mol. Mass.:39690.94
Organism:Homo sapiens (Human)
Description:P34972
Residue:360
BDBM50392297
NameBDBM50392297
Synonyms:CHEMBL2153766
TypeSmall organic molecule
Emp. Form.C28H28Cl2N6O4S
Mol. Mass.615.531
SMILESC[C@H](NC(=O)[C@H](C)N=C(NS(=O)(=O)c1ccc(Cl)cc1)N1CC(C(=N1)c1ccc(Cl)cc1)c1ccccc1)C(N)=O