Reaction Details
TargetCannabinoid receptor 1
LigandBDBM50392294
Substrate/Competitorn/a
Meas. Tech.ChEMBL_851480 (CHEMBL2156596)
IC50 4±n/a nM
Citation Chorvat, RJBerbaum, JSeriacki, KMcElroy, JF JD-5006 and JD-5037: peripherally restricted (PR) cannabinoid-1 receptor blockers related to SLV-319 (Ibipinabant) as metabolic disorder therapeutics devoid of CNS liabilities. Bioorg Med Chem Lett22:6173-80 (2012) 
 
Cannabinoid receptor 1
Name:Cannabinoid receptor 1
Type:G Protein-Coupled Receptor (GPCR)
Mol. Mass.:52868.96
Organism:Homo sapiens (Human)
Description:P21554
Residue:472
BDBM50392294
NameBDBM50392294
Synonyms:CHEMBL2153763
TypeSmall organic molecule
Emp. Form.C28H30ClN5O4S
Mol. Mass.568.087
SMILESCOc1cccc(c1)S(=O)(=O)NC(=N[C@@H](C(C)C)C(N)=O)N1CC(C(=N1)c1ccc(Cl)cc1)c1ccccc1