Reaction Details
TargetKiSS-1 receptor
LigandBDBM26349
Substrate/Competitorn/a
Meas. Tech.ChEMBL_851681 (CHEMBL2155898)
IC50 0.082±n/a nM
Citation Asami, TNishizawa, NIshibashi, YNishibori, KNakayama, MHorikoshi, YMatsumoto, SYamaguchi, MMatsumoto, HTarui, NOhtaki, TKitada, C Serum stability of selected decapeptide agonists of KISS1R using pseudopeptides. Bioorg Med Chem Lett22:6391-6 (2012) 
 
KiSS-1 receptor
Name:KiSS-1 receptor
Type:G Protein-Coupled Receptor (GPCR)
Mol. Mass.:42613.79
Organism:Homo sapiens (Human)
Description:Binding assay was performed using membranes from the CHO cell transfectants.
Residue:398
BDBM26349
NameBDBM26349
Synonyms:(2S)-2-[(2S)-2-[(2S)-2-[(2S)-2-amino-3-(4-hydroxyphenyl)propanamido]butanediamido]-3-(1H-indol-3-yl)propanamido]-N-[(1S)-1-{[(1S)-1-[({[(1S)-1-{[(1S)-4-carbamimidamido-1-{[(1S)-1-carbamoyl-2-phenylethyl]carbamoyl}butyl]carbamoyl}-3-methylbutyl]carbamoyl}methyl)carbamoyl]-2-phenylethyl]carbamoyl}-2-hydroxyethyl]butanediamide Kisspeptin-10
Type10-mer
Emp. Form.C63H83N17O14
Mol. Mass.1302.4386
SMILESCC(C)C[C@H](NC(=O)CNC(=O)[C@H](Cc1ccccc1)NC(=O)[C@H](CO)NC(=O)[C@H](CC(N)=O)NC(=O)[C@H](Cc1c[nH]c2ccccc12)NC(=O)[C@H](CC(N)=O)NC(=O)[C@@H](N)Cc1ccc(O)cc1)C(=O)N[C@@H](CCCN=C(N)N)C(=O)N[C@@H](Cc1ccccc1)C(N)=O