Reaction Details
TargetMetabotropic glutamate receptor 5
LigandBDBM50392425
Substrate/Competitorn/a
Meas. Tech.ChEMBL_851728 (CHEMBL2156070)
Ki>100000±n/a nM
Citation Manka, JTVinson, PNGregory, KJZhou, YWilliams, RGogi, KDays, EJadhav, SHerman, EJLavreysen, HMackie, CBartolomé, JMMacdonald, GJSteckler, TDaniels, JSWeaver, CDNiswender, CMJones, CKConn, PJLindsley, CWStauffer, SR Optimization of an ether series of mGlu5 positive allosteric modulators: molecular determinants of MPEP-site interaction crossover. Bioorg Med Chem Lett22:6481-5 (2012) 
 
Metabotropic glutamate receptor 5
Name:Metabotropic glutamate receptor 5
Type:Enzyme
Mol. Mass.:131900.14
Organism:Rattus norvegicus (Rat)
Description:P31424
Residue:1203
BDBM50392425
NameBDBM50392425
Synonyms:CHEMBL2151790
TypeSmall organic molecule
Emp. Form.C17H17F2NO2
Mol. Mass.305.3192
SMILESCCCCOc1ccc(cc1)C(=O)Nc1ccc(F)cc1F