Reaction Details
TargetMetabotropic glutamate receptor 5
LigandBDBM50392432
Substrate/Competitorn/a
Meas. Tech.ChEMBL_851728 (CHEMBL2156070)
Ki 153±n/a nM
Citation Manka, JTVinson, PNGregory, KJZhou, YWilliams, RGogi, KDays, EJadhav, SHerman, EJLavreysen, HMackie, CBartolomé, JMMacdonald, GJSteckler, TDaniels, JSWeaver, CDNiswender, CMJones, CKConn, PJLindsley, CWStauffer, SR Optimization of an ether series of mGlu5 positive allosteric modulators: molecular determinants of MPEP-site interaction crossover. Bioorg Med Chem Lett22:6481-5 (2012) 
 
Metabotropic glutamate receptor 5
Name:Metabotropic glutamate receptor 5
Type:Enzyme
Mol. Mass.:131900.14
Organism:Rattus norvegicus (Rat)
Description:P31424
Residue:1203
BDBM50392432
NameBDBM50392432
Synonyms:CHEMBL2151817
TypeSmall organic molecule
Emp. Form.C19H23FN2O2
Mol. Mass.330.3965
SMILESC[C@@H](NC(=O)c1ccc(OCc2cccc(F)c2)nc1)C(C)(C)C