Reaction Details
TargetKiSS-1 receptor
LigandBDBM50392487
Substrate/Competitorn/a
Meas. Tech.ChEMBL_852184 (CHEMBL2157605)
EC50 0.32±n/a nM
Citation Asami, TNishizawa, NIshibashi, YNishibori, KHorikoshi, YMatsumoto, HOhtaki, TKitada, C Trypsin resistance of a decapeptide KISS1R agonist containing an N¿-methylarginine substitution. Bioorg Med Chem Lett22:6328-32 (2012) 
 
KiSS-1 receptor
Name:KiSS-1 receptor
Type:G Protein-Coupled Receptor (GPCR)
Mol. Mass.:42613.79
Organism:Homo sapiens (Human)
Description:Binding assay was performed using membranes from the CHO cell transfectants.
Residue:398
BDBM50392487
NameBDBM50392487
Synonyms:CHEMBL2152057
TypeSmall organic molecule
Emp. Form.C65H87N17O14
Mol. Mass.1330.4918
SMILESCNC(NC)=NCCC[C@H](NC(=O)[C@H](CC(C)C)NC(=O)CNC(=O)[C@H](Cc1ccccc1)NC(=O)[C@H](CO)NC(=O)[C@H](CC(N)=O)NC(=O)[C@H](Cc1c[nH]c2ccccc12)NC(=O)[C@H](CC(N)=O)NC(=O)[C@@H](N)Cc1ccc(O)cc1)C(=O)N[C@@H](Cc1ccccc1)C(N)=O