Reaction Details
TargetCholesteryl ester transfer protein
LigandBDBM50392527
Substrate/Competitorn/a
Meas. Tech.ChEMBL_852276 (CHEMBL2155542)
IC50 2±n/a nM
Citation Miller, MMLiu, YJiang, JJohnson, JAKamau, MNirschl, DSWang, YHarikrishnan, LTaylor, DSChen, AYYin, XSeethala, RPeterson, TLZvyaga, TZhang, JHuang, CSWexler, RRPoss, MALawrence, RMAdam, LPSalvati, ME Identification of a potent and metabolically stable series of fluorinated diphenylpyridylethanamine-based cholesteryl ester transfer protein inhibitors. Bioorg Med Chem Lett22:6503-8 (2012) 
 
Cholesteryl ester transfer protein
Name:Cholesteryl ester transfer protein
Type:Enzyme
Mol. Mass.:54751.53
Organism:Homo sapiens (Human)
Description:P11597
Residue:493
BDBM50392527
NameBDBM50392527
Synonyms:CHEMBL2152180
TypeSmall organic molecule
Emp. Form.C25H20ClF8N3O2
Mol. Mass.581.885
SMILESFC(F)C(F)(F)Oc1cc(F)cc(c1)[C@](Cc1ccccc1)(NC(=O)NCCC(F)(F)F)c1ccc(Cl)cn1