Reaction Details
TargetE3 ubiquitin-protein ligase Mdm2
LigandBDBM31197
Substrate/Competitorn/a
Meas. Tech.ChEMBL_852440 (CHEMBL2156543)
IC50 180±n/a nM
Citation Miyazaki, MKawato, HNaito, HIkeda, MMiyazaki, MKitagawa, MSeki, TFukutake, SAonuma, MSoga, T Discovery of novel dihydroimidazothiazole derivatives as p53-MDM2 protein-protein interaction inhibitors: synthesis, biological evaluation and structure-activity relationships. Bioorg Med Chem Lett22:6338-42 (2012) 
 
E3 ubiquitin-protein ligase Mdm2
Name:E3 ubiquitin-protein ligase Mdm2
Type:Oncoprotein
Mol. Mass.:55196.54
Organism:Homo sapiens (Human)
Description:Q00987
Residue:491
BDBM31197
NameBDBM31197
Synonyms:CHEMBL211045 med.21724, Compound 186
TypeSmall organic molecule
Emp. Form.C30H30Cl2N4O4
Mol. Mass.581.49
SMILESCOc1ccc(C2=NC(C(N2C(=O)N2CCNC(=O)C2)c2ccc(Cl)cc2)c2ccc(Cl)cc2)c(OC(C)C)c1