Reaction Details
TargetCannabinoid receptor 1
LigandBDBM50392554
Substrate/Competitorn/a
Meas. Tech.ChEMBL_854393 (CHEMBL2154764)
Ki 296.8±n/a nM
Citation Pasquini, SDe Rosa, MLigresti, AMugnaini, CBrizzi, ACaradonna, NPCascio, MGBolognini, DPertwee, RGDi Marzo, VCorelli, F Investigations on the 4-quinolone-3-carboxylic acid motif. 6. Synthesis and pharmacological evaluation of 7-substituted quinolone-3-carboxamide derivatives as high affinity ligands for cannabinoid receptors. Eur J Med Chem58:30-43 (2012) 
 
Cannabinoid receptor 1
Name:Cannabinoid receptor 1
Type:G Protein-Coupled Receptor (GPCR)
Mol. Mass.:52868.96
Organism:Homo sapiens (Human)
Description:P21554
Residue:472
BDBM50392554
NameBDBM50392554
Synonyms:CHEMBL2152806
TypeSmall organic molecule
Emp. Form.C23H29FN2O3
Mol. Mass.400.4864
SMILESCOCCn1cc(C(=O)N[C@@H]2C(C)(C)C3CC[C@]2(C)C3)c(=O)c2ccc(F)cc12