Reaction Details
TargetCannabinoid receptor 1
LigandBDBM50272486
Substrate/Competitorn/a
Meas. Tech.ChEMBL_854393 (CHEMBL2154764)
Ki 5.3±n/a nM
Citation Pasquini, SDe Rosa, MLigresti, AMugnaini, CBrizzi, ACaradonna, NPCascio, MGBolognini, DPertwee, RGDi Marzo, VCorelli, F Investigations on the 4-quinolone-3-carboxylic acid motif. 6. Synthesis and pharmacological evaluation of 7-substituted quinolone-3-carboxamide derivatives as high affinity ligands for cannabinoid receptors. Eur J Med Chem58:30-43 (2012) 
 
Cannabinoid receptor 1
Name:Cannabinoid receptor 1
Type:G Protein-Coupled Receptor (GPCR)
Mol. Mass.:52868.96
Organism:Homo sapiens (Human)
Description:P21554
Residue:472
BDBM50272486
NameBDBM50272486
Synonyms:CHEMBL498527 | N-(Adamant-1-yl)-4-oxo-1-pentyl-7-(phenylthio)-1,4-dihydroquinoline-3-carboxamide
TypeSmall organic molecule
Emp. Form.C31H36N2O2S
Mol. Mass.500.695
SMILESCCCCCn1cc(C(=O)NC23CC4CC(CC(C4)C2)C3)c(=O)c2ccc(Sc3ccccc3)cc12