Reaction Details
TargetCoagulation factor X
LigandBDBM50392588
Substrate/Competitorn/a
Meas. Tech.ChEMBL_854009 (CHEMBL2155306)
IC50 5.4±n/a nM
Citation Pandya, VJain, MChakrabarti, GSoni, HParmar, BChaugule, BPatel, JJarag, TJoshi, JJoshi, NRath, AUnadkat, VSharma, BAjani, HKumar, JSairam, KVPatel, HPatel, P Synthesis and structure-activity relationship of potent, selective and orally active anthranilamide-based factor Xa inhibitors: application of weakly basic sulfoximine group as novel S4 binding element. Eur J Med Chem58:136-52 (2012) 
 
Coagulation factor X
Name:Coagulation factor X
Type:Enzyme
Mol. Mass.:54726.60
Organism:Homo sapiens (Human)
Description:n/a
Residue:488
BDBM50392588
NameBDBM50392588
Synonyms:CHEMBL2153376
TypeSmall organic molecule
Emp. Form.C23H19Cl2N5O4S
Mol. Mass.532.399
SMILESCN=CC(=O)N=S(C)(=O)c1ccc(cc1)C(=O)Nc1ccc(Cl)cc1C(=O)Nc1ccc(Cl)cn1