Reaction Details
TargetCoagulation factor X
LigandBDBM50392596
Substrate/Competitorn/a
Meas. Tech.ChEMBL_854009 (CHEMBL2155306)
IC50 3.4±n/a nM
Citation Pandya, VJain, MChakrabarti, GSoni, HParmar, BChaugule, BPatel, JJarag, TJoshi, JJoshi, NRath, AUnadkat, VSharma, BAjani, HKumar, JSairam, KVPatel, HPatel, P Synthesis and structure-activity relationship of potent, selective and orally active anthranilamide-based factor Xa inhibitors: application of weakly basic sulfoximine group as novel S4 binding element. Eur J Med Chem58:136-52 (2012) 
 
Coagulation factor X
Name:Coagulation factor X
Type:Enzyme
Mol. Mass.:54726.60
Organism:Homo sapiens (Human)
Description:n/a
Residue:488
BDBM50392596
NameBDBM50392596
Synonyms:CHEMBL2153393
TypeSmall organic molecule
Emp. Form.C27H29Cl2N5O5S
Mol. Mass.606.521
SMILESCCN(CC)CC(=O)NS(=C)(=O)c1ccc(cc1)C(=O)Nc1c(OC)cc(Cl)cc1C(=O)Nc1ccc(Cl)cn1