Reaction Details
TargetPlasminogen
LigandBDBM50392589
Substrate/Competitorn/a
Meas. Tech.ChEMBL_854019 (CHEMBL2155316)
Ki>20000±n/a nM
Citation Pandya, VJain, MChakrabarti, GSoni, HParmar, BChaugule, BPatel, JJarag, TJoshi, JJoshi, NRath, AUnadkat, VSharma, BAjani, HKumar, JSairam, KVPatel, HPatel, P Synthesis and structure-activity relationship of potent, selective and orally active anthranilamide-based factor Xa inhibitors: application of weakly basic sulfoximine group as novel S4 binding element. Eur J Med Chem58:136-52 (2012) 
 
Plasminogen
Name:Plasminogen
Type:Enzyme
Mol. Mass.:90579.18
Organism:Homo sapiens (Human)
Description:n/a
Residue:810
BDBM50392589
NameBDBM50392589
Synonyms:CHEMBL2153377
TypeSmall organic molecule
Emp. Form.C24H21Cl2N5O4S
Mol. Mass.546.426
SMILESCCN=CC(=O)N=S(C)(=O)c1ccc(cc1)C(=O)Nc1ccc(Cl)cc1C(=O)Nc1ccc(Cl)cn1