Reaction Details
TargetAlpha-1B adrenergic receptor
LigandBDBM50392637
Substrate/Competitorn/a
Meas. Tech.ChEMBL_854041 (CHEMBL2155338)
Ki 5.75±n/a nM
Citation Fumagalli, LPallavicini, MBudriesi, RGobbi, MStraniero, VZagami, MChiodini, GBolchi, CChiarini, AMicucci, MValoti, E Affinity and activity profiling of unichiral 8-substituted 1,4-benzodioxane analogues of WB4101 reveals a potent and selectivea1B-adrenoceptor antagonist. Eur J Med Chem58:184-91 (2012) 
 
Alpha-1B adrenergic receptor
Name:Alpha-1B adrenergic receptor
Type:Enzyme
Mol. Mass.:56862.13
Organism:Homo sapiens (Human)
Description:P35368
Residue:520
BDBM50392637
NameBDBM50392637
Synonyms:CHEMBL215421
TypeSmall organic molecule
Emp. Form.C19H23NO5
Mol. Mass.345.3896
SMILESCOc1cccc(OC)c1OCCNC[C@H]1COc2ccccc2O1