Reaction Details
Target5-hydroxytryptamine receptor 1A
LigandBDBM50392642
Substrate/Competitorn/a
Meas. Tech.ChEMBL_854045 (CHEMBL2155386)
Ki 12.88±n/a nM
Citation Fumagalli, LPallavicini, MBudriesi, RGobbi, MStraniero, VZagami, MChiodini, GBolchi, CChiarini, AMicucci, MValoti, E Affinity and activity profiling of unichiral 8-substituted 1,4-benzodioxane analogues of WB4101 reveals a potent and selectivea1B-adrenoceptor antagonist. Eur J Med Chem58:184-91 (2012) 
 
5-hydroxytryptamine receptor 1A
Name:5-hydroxytryptamine receptor 1A
Type:G Protein-Coupled Receptor (GPCR)
Mol. Mass.:46445.29
Organism:Rattus norvegicus (rat)
Description:Binding assays were performed using rat hippocampal membranes.
Residue:422
BDBM50392642
NameBDBM50392642
Synonyms:CHEMBL2153554
TypeSmall organic molecule
Emp. Form.C20H25NO6
Mol. Mass.375.4156
SMILESCOc1cccc(OC)c1OCCNC[C@@H]1COc2cccc(OC)c2O1