Reaction Details
TargetMethionine synthase
LigandBDBM50392650
Substrate/Competitorn/a
Meas. Tech.ChEMBL_854111 (CHEMBL2153942)
IC50 66380±n/a nM
Citation Zhang, ZTian, CZhou, SWang, WGuo, YXia, JLiu, ZWang, BWang, XGolding, BTGriff, RJDu, YLiu, J Mechanism-based design, synthesis and biological studies of N5-substituted tetrahydrofolate analogs as inhibitors of cobalamin-dependent methionine synthase and potential anticancer agents. Eur J Med Chem58:228-36 (2012) 
 
Methionine synthase
Name:Methionine synthase
Type:PROTEIN
Mol. Mass.:140503.96
Organism:Homo sapiens (Human)
Description:ChEMBL_854111
Residue:1265
BDBM50392650
NameBDBM50392650
Synonyms:CHEMBL2153704
TypeSmall organic molecule
Emp. Form.C21H25N7O5
Mol. Mass.455.4671
SMILESNc1nc(N)c2N3CN(CC3CCc2n1)c1ccc(cc1)C(=O)N[C@@H](CCC(O)=O)C(O)=O