Reaction Details
Target72 kDa type IV collagenase
LigandBDBM50392687
Substrate/Competitorn/a
Meas. Tech.ChEMBL_854272 (CHEMBL2154438)
IC50 278±n/a nM
Citation Nicolotti, OCatto, MGiangreco, IBarletta, MLeonetti, FStefanachi, APisani, LCellamare, STortorella, PLoiodice, FCarotti, A Design, synthesis and biological evaluation of 5-hydroxy, 5-substituted-pyrimidine-2,4,6-triones as potent inhibitors of gelatinases MMP-2 and MMP-9. Eur J Med Chem58:368-76 (2012) 
 
72 kDa type IV collagenase
Name:72 kDa type IV collagenase
Type:Enzyme
Mol. Mass.:73870.36
Organism:Homo sapiens (Human)
Description: P08253
Residue:660
BDBM50392687
NameBDBM50392687
Synonyms:CHEMBL2151356
TypeSmall organic molecule
Emp. Form.C18H13ClN2O5
Mol. Mass.372.759
SMILESOC1(CC(=O)c2ccc(cc2)-c2ccc(Cl)cc2)C(=O)NC(=O)NC1=O