Reaction Details
Target72 kDa type IV collagenase
LigandBDBM50392692
Substrate/Competitorn/a
Meas. Tech.ChEMBL_854272 (CHEMBL2154438)
IC50 58±n/a nM
Citation Nicolotti, OCatto, MGiangreco, IBarletta, MLeonetti, FStefanachi, APisani, LCellamare, STortorella, PLoiodice, FCarotti, A Design, synthesis and biological evaluation of 5-hydroxy, 5-substituted-pyrimidine-2,4,6-triones as potent inhibitors of gelatinases MMP-2 and MMP-9. Eur J Med Chem58:368-76 (2012) 
 
72 kDa type IV collagenase
Name:72 kDa type IV collagenase
Type:Enzyme
Mol. Mass.:73870.36
Organism:Homo sapiens (Human)
Description: P08253
Residue:660
BDBM50392692
NameBDBM50392692
Synonyms:CHEMBL2151361
TypeSmall organic molecule
Emp. Form.C19H16N2O7S
Mol. Mass.416.405
SMILESCS(=O)(=O)c1ccc(cc1)-c1ccc(cc1)C(=O)CC1(O)C(=O)NC(=O)NC1=O