Reaction Details
TargetNeutrophil collagenase
LigandBDBM50392693
Substrate/Competitorn/a
Meas. Tech.ChEMBL_854274 (CHEMBL2154440)
IC50 109±n/a nM
Citation Nicolotti, OCatto, MGiangreco, IBarletta, MLeonetti, FStefanachi, APisani, LCellamare, STortorella, PLoiodice, FCarotti, A Design, synthesis and biological evaluation of 5-hydroxy, 5-substituted-pyrimidine-2,4,6-triones as potent inhibitors of gelatinases MMP-2 and MMP-9. Eur J Med Chem58:368-76 (2012) 
 
Neutrophil collagenase
Name:Neutrophil collagenase
Type:Enzyme
Mol. Mass.:53413.48
Organism:Homo sapiens (Human)
Description:P22894
Residue:467
BDBM50392693
NameBDBM50392693
Synonyms:CHEMBL2151362
TypeSmall organic molecule
Emp. Form.C20H16N2O6
Mol. Mass.380.3508
SMILESCC(=O)c1ccc(cc1)-c1ccc(cc1)C(=O)CC1(O)C(=O)NC(=O)NC1=O