Reaction Details
TargetNeutrophil collagenase
LigandBDBM50392696
Substrate/Competitorn/a
Meas. Tech.ChEMBL_854274 (CHEMBL2154440)
IC50 153±n/a nM
Citation Nicolotti, OCatto, MGiangreco, IBarletta, MLeonetti, FStefanachi, APisani, LCellamare, STortorella, PLoiodice, FCarotti, A Design, synthesis and biological evaluation of 5-hydroxy, 5-substituted-pyrimidine-2,4,6-triones as potent inhibitors of gelatinases MMP-2 and MMP-9. Eur J Med Chem58:368-76 (2012) 
 
Neutrophil collagenase
Name:Neutrophil collagenase
Type:Enzyme
Mol. Mass.:53413.48
Organism:Homo sapiens (Human)
Description:P22894
Residue:467
BDBM50392696
NameBDBM50392696
Synonyms:CHEMBL2151365
TypeSmall organic molecule
Emp. Form.C16H12N2O5S
Mol. Mass.344.342
SMILESOC1(CC(=O)c2ccc(cc2)-c2ccsc2)C(=O)NC(=O)NC1=O