Reaction Details
TargetCannabinoid receptor 1
LigandBDBM50392712
Substrate/Competitorn/a
Meas. Tech.ChEMBL_854280 (CHEMBL2154446)
Ki>3000±n/a nM
Citation Gembus, VFurman, CMillet, RMansouri, RChavatte, PLevacher, VBrière, JF Scaffold hopping strategy toward original pyrazolines as selective CB2 receptor ligands. Eur J Med Chem58:396-404 (2012) 
 
Cannabinoid receptor 1
Name:Cannabinoid receptor 1
Type:G Protein-Coupled Receptor (GPCR)
Mol. Mass.:52868.96
Organism:Homo sapiens (Human)
Description:P21554
Residue:472
BDBM50392712
NameBDBM50392712
Synonyms:CHEMBL2151381
TypeSmall organic molecule
Emp. Form.C22H30ClN3O
Mol. Mass.387.946
SMILESCc1cc(ccc1Cl)C1=NN(CC1C1CCCC1)C(=O)NC1CCCCC1