Reaction Details
TargetCannabinoid receptor 2
LigandBDBM50392700
Substrate/Competitorn/a
Meas. Tech.ChEMBL_854281 (CHEMBL2154447)
Ki>3000±n/a nM
Citation Gembus, VFurman, CMillet, RMansouri, RChavatte, PLevacher, VBrière, JF Scaffold hopping strategy toward original pyrazolines as selective CB2 receptor ligands. Eur J Med Chem58:396-404 (2012) 
 
Cannabinoid receptor 2
Name:Cannabinoid receptor 2
Type:G Protein-Coupled Receptor (GPCR)
Mol. Mass.:39690.94
Organism:Homo sapiens (Human)
Description:P34972
Residue:360
BDBM50392700
NameBDBM50392700
Synonyms:CHEMBL2151369
TypeSmall organic molecule
Emp. Form.C23H21N3O
Mol. Mass.355.4323
SMILESO=C(Nc1ccccc1)N1CC(Cc2ccccc2)C(=N1)c1ccccc1