Reaction Details
TargetCannabinoid receptor 2
LigandBDBM50392706
Substrate/Competitorn/a
Meas. Tech.ChEMBL_854281 (CHEMBL2154447)
Ki>3000±n/a nM
Citation Gembus, VFurman, CMillet, RMansouri, RChavatte, PLevacher, VBrière, JF Scaffold hopping strategy toward original pyrazolines as selective CB2 receptor ligands. Eur J Med Chem58:396-404 (2012) 
 
Cannabinoid receptor 2
Name:Cannabinoid receptor 2
Type:G Protein-Coupled Receptor (GPCR)
Mol. Mass.:39690.94
Organism:Homo sapiens (Human)
Description:P34972
Residue:360
BDBM50392706
NameBDBM50392706
Synonyms:CHEMBL2151375
TypeSmall organic molecule
Emp. Form.C24H22ClN3O
Mol. Mass.403.904
SMILESCc1cc(ccc1Cl)C1=NN(CC1Cc1ccccc1)C(=O)Nc1ccccc1