Reaction Details
TargetCannabinoid receptor 2
LigandBDBM50392701
Substrate/Competitorn/a
Meas. Tech.ChEMBL_854283 (CHEMBL2154449)
EC50 297±n/a nM
Citation Gembus, VFurman, CMillet, RMansouri, RChavatte, PLevacher, VBrière, JF Scaffold hopping strategy toward original pyrazolines as selective CB2 receptor ligands. Eur J Med Chem58:396-404 (2012) 
 
Cannabinoid receptor 2
Name:Cannabinoid receptor 2
Type:G Protein-Coupled Receptor (GPCR)
Mol. Mass.:39690.94
Organism:Homo sapiens (Human)
Description:P34972
Residue:360
BDBM50392701
NameBDBM50392701
Synonyms:CHEMBL2151370
TypeSmall organic molecule
Emp. Form.C23H27N3O
Mol. Mass.361.48
SMILESO=C(NC1CCCCC1)N1CC(Cc2ccccc2)C(=N1)c1ccccc1