Reaction Details
TargetCannabinoid receptor 2
LigandBDBM50392710
Substrate/Competitorn/a
Meas. Tech.ChEMBL_854283 (CHEMBL2154449)
EC50 371±n/a nM
Citation Gembus, VFurman, CMillet, RMansouri, RChavatte, PLevacher, VBrière, JF Scaffold hopping strategy toward original pyrazolines as selective CB2 receptor ligands. Eur J Med Chem58:396-404 (2012) 
 
Cannabinoid receptor 2
Name:Cannabinoid receptor 2
Type:G Protein-Coupled Receptor (GPCR)
Mol. Mass.:39690.94
Organism:Homo sapiens (Human)
Description:P34972
Residue:360
BDBM50392710
NameBDBM50392710
Synonyms:CHEMBL2151379
TypeSmall organic molecule
Emp. Form.C25H30ClN3O
Mol. Mass.423.978
SMILESCc1ccc(CC2CN(N=C2c2ccc(Cl)c(C)c2)C(=O)NC2CCCCC2)cc1