Reaction Details
TargetHistamine H1 receptor
LigandBDBM50341447
Substrate/Competitorn/a
Meas. Tech.ChEMBL_853257 (CHEMBL2154958)
Ki 15.85±n/a nM
Citation Berlin, MBoyce, CWRuiz Mde, L Histamine H3 receptor as a drug discovery target. J Med Chem54:26-53 (2011) 
 
Histamine H1 receptor
Name:Histamine H1 receptor
Type:G Protein-Coupled Receptor (GPCR)
Mol. Mass.:55808.72
Organism:Homo sapiens (Human)
Description:Cell pellets from SK-N-MC cells transfected with human H1 receptor were used in binding assay.
Residue:487
BDBM50341447
NameBDBM50341447
Synonyms:4-[(4-Chlorophenyl)methyl]-2-({(2R)-1-[4-(4-{[3-(hexahydro-1H-azepin-1-yl)propyl]oxy}phenyl)butyl]-2-pyrrolidinyl}methyl)-1(2H)-phthalazinone | CHEMBL1767164
TypeSmall organic molecule
Emp. Form.C39H49ClN4O2
Mol. Mass.641.285
SMILESClc1ccc(Cc2nn(C[C@H]3CCCN3CCCCc3ccc(OCCCN4CCCCCC4)cc3)c(=O)c3ccccc23)cc1