Reaction Details
TargetHistamine H3 receptor
LigandBDBM50193199
Substrate/Competitorn/a
Meas. Tech.ChEMBL_853238 (CHEMBL2154939)
Ki 6.7±n/a nM
Citation Berlin, MBoyce, CWRuiz Mde, L Histamine H3 receptor as a drug discovery target. J Med Chem54:26-53 (2011) 
 
Histamine H3 receptor
Name:Histamine H3 receptor
Type:G Protein-Coupled Receptor (GPCR)
Mol. Mass.:48691.47
Organism:Homo sapiens (Human)
Description:Binding assays were using CHO cells stably expressing hH3R receptors.
Residue:445
BDBM50193199
NameBDBM50193199
Synonyms:(S)-1-(2-(pyrrolidin-1-ylmethyl)pyrrolidin-1-yl)-3-(4-(trifluoromethyl)phenyl)prop-2-en-1-one CHEMBL218790
TypeSmall organic molecule
Emp. Form.C19H23F3N2O
Mol. Mass.352.3939
SMILESFC(F)(F)c1ccc(\C=C\C(=O)N2CCC[C@H]2CN2CCCC2)cc1