Reaction Details
TargetPotassium voltage-gated channel subfamily H member 2
LigandBDBM50392796
Substrate/Competitorn/a
Meas. Tech.ChEMBL_853148 (CHEMBL2154697)
IC50>32000±n/a nM
Citation Wang, TLamb, MLBlock, MHDavies, AMHan, YHoffmann, EIoannidis, SJosey, JALiu, ZYLyne, PDMacIntyre, TMohr, PJOmer, CASjögren, TThress, KWang, BWang, HYu, DZhang, HJ Discovery of Disubstituted Imidazo[4,5-b]pyridines and Purines as Potent TrkA Inhibitors. ACS Med Chem Lett3:705-709 (2012) 
 
Potassium voltage-gated channel subfamily H member 2
Name:Potassium voltage-gated channel subfamily H member 2
Type:Multi-pass membrane protein
Mol. Mass.:126672.65
Organism:Homo sapiens (Human)
Description:Q12809
Residue:1159
BDBM50392796
NameBDBM50392796
Synonyms:CHEMBL2151326
TypeSmall organic molecule
Emp. Form.C17H15F2N7O2
Mol. Mass.387.3435
SMILESCOc1cc(Nc2nc3n(cnc3cc2F)[C@@H](CO)c2ccc(F)cn2)[nH]n1