Reaction Details
TargetSerine/threonine-protein kinase WNK3
LigandBDBM50392791
Substrate/Competitorn/a
Meas. Tech.ChEMBL_853169 (CHEMBL2154718)
IC50 99.8±n/a nM
Citation Wang, TLamb, MLBlock, MHDavies, AMHan, YHoffmann, EIoannidis, SJosey, JALiu, ZYLyne, PDMacIntyre, TMohr, PJOmer, CASjögren, TThress, KWang, BWang, HYu, DZhang, HJ Discovery of Disubstituted Imidazo[4,5-b]pyridines and Purines as Potent TrkA Inhibitors. ACS Med Chem Lett3:705-709 (2012) 
 
Serine/threonine-protein kinase WNK3
Name:Serine/threonine-protein kinase WNK3
Type:PROTEIN
Mol. Mass.:198400.78
Organism:Homo sapiens (Human)
Description:ChEMBL_959020
Residue:1800
BDBM50392791
NameBDBM50392791
Synonyms:CHEMBL2151321 | US8486966, 1
TypeSmall organic molecule
Emp. Form.C19H20FN7O
Mol. Mass.381.4068
SMILESCC(C)Oc1cc(n[nH]1)-n1cnc2ccc(N[C@@H](C)c3ccc(F)cn3)nc12