Reaction Details
TargetDelta-type opioid receptor
LigandBDBM50392797
Substrate/Competitorn/a
Meas. Tech.ChEMBL_853292 (CHEMBL2155052)
Ki 204.17±n/a nM
Citation Harvey, JHLong, DHEngland, PMWhistler, JL Tuned-Affinity Bivalent Ligands for the Characterization of Opioid Receptor Heteromers. ACS Med Chem Lett3:640-644 (2012) 
 
Delta-type opioid receptor
Name:Delta-type opioid receptor
Type:Enzyme Catalytic Domain
Mol. Mass.:40577.25
Organism:MOUSE
Description:P32300
Residue:372
BDBM50392797
NameBDBM50392797
Synonyms:CHEMBL2151327
TypeSmall organic molecule
Emp. Form.C64H75N7O12
Mol. Mass.1134.32
SMILESCN1CC[C@@]23[C@H]4Oc5c2c(C[C@@H]1[C@]3(O)CC[C@@H]4NC(=O)COCC(=O)NCCCCCNC(=O)COCC(=O)Nc1cccc2c3C[C@@]4(O)[C@H]6Cc7ccc(OCCc8ccccc8)c8O[C@@H](c3[nH]c12)[C@]4(CCN6CC1CC1)c78)ccc5O