Reaction Details
TargetDelta-type opioid receptor
LigandBDBM50392799
Substrate/Competitorn/a
Meas. Tech.ChEMBL_853292 (CHEMBL2155052)
Ki 19.95±n/a nM
Citation Harvey, JHLong, DHEngland, PMWhistler, JL Tuned-Affinity Bivalent Ligands for the Characterization of Opioid Receptor Heteromers. ACS Med Chem Lett3:640-644 (2012) 
 
Delta-type opioid receptor
Name:Delta-type opioid receptor
Type:Enzyme Catalytic Domain
Mol. Mass.:40577.25
Organism:MOUSE
Description:P32300
Residue:372
BDBM50392799
NameBDBM50392799
Synonyms:CHEMBL2151245
TypeSmall organic molecule
Emp. Form.C58H77N7O10
Mol. Mass.1032.2729
SMILES[#6]-[#6]-[#7](-[#6]-[#6])-[#6](=O)-c1ccc(cc1)-[#6](=[#6]-1\[#6]-[#6]-[#7]-[#6]-[#6]-1)\c1c(-[#6])cc(-[#7]-[#6](=O)-[#6]-[#8]-[#6]-[#6](=O)-[#7]-[#6]-[#6]-[#6]-[#6]-[#6]-[#7]-[#6](=O)-[#6]-[#8]-[#6]-[#6](=O)-[#7]-[#6@@H]-2-[#6]-[#6][C@@]3([#8])[#6@H]-4-[#6]-c5ccc(-[#8])c6-[#8]-[#6@@H]-2[C@]3([#6]-[#6]-[#7]-4-[#6]-[#6]-2-[#6]-[#6]-2)c56)cc1-[#6]