Reaction Details
TargetDelta-type opioid receptor
LigandBDBM50392801
Substrate/Competitorn/a
Meas. Tech.ChEMBL_853292 (CHEMBL2155052)
Ki 30.9±n/a nM
Citation Harvey, JHLong, DHEngland, PMWhistler, JL Tuned-Affinity Bivalent Ligands for the Characterization of Opioid Receptor Heteromers. ACS Med Chem Lett3:640-644 (2012) 
 
Delta-type opioid receptor
Name:Delta-type opioid receptor
Type:Enzyme Catalytic Domain
Mol. Mass.:40577.25
Organism:MOUSE
Description:P32300
Residue:372
BDBM50392801
NameBDBM50392801
Synonyms:CHEMBL2151247
TypeSmall organic molecule
Emp. Form.C34H49N5O9
Mol. Mass.671.781
SMILESCNC(=O)COCC(=O)NCCCCCNC(=O)COCC(=O)N[C@@H]1CC[C@@]2(O)[C@H]3Cc4ccc(O)c5O[C@@H]1[C@]2(CCN3CC1CC1)c45