Reaction Details
TargetBeta-secretase 1
LigandBDBM50392836
Substrate/Competitorn/a
Meas. Tech.ChEMBL_853304 (CHEMBL2155064)
IC50 13±n/a nM
Citation Stamford, AWScott, JDLi, SWBabu, STadesse, DHunter, RWu, YMisiaszek, JCumming, JNGilbert, EJHuang, CMcKittrick, BAHong, LGuo, TZhu, ZStrickland, COrth, PVoigt, JHKennedy, MEChen, XKuvelkar, RHodgson, RHyde, LACox, KFavreau, LParker, EMGreenlee, WJ Discovery of an Orally Available, Brain Penetrant BACE1 Inhibitor that Affords Robust CNS Aß Reduction. ACS Med Chem Lett3:897-902 (2012) 
 
Beta-secretase 1
Name:Beta-secretase 1
Type:Protein
Mol. Mass.:55755.10
Organism:Homo sapiens (Human)
Description:P56817
Residue:501
BDBM50392836
NameBDBM50392836
Synonyms:CHEMBL2151141
TypeSmall organic molecule
Emp. Form.C18H18N4OS
Mol. Mass.338.427
SMILESCC#Cc1cncc(c1)-c1csc(c1)[C@]1(C)CC(=O)N(C)C(N)=N1