Reaction Details
TargetProtein-glutamine gamma-glutamyltransferase K
LigandBDBM50392881
Substrate/Competitorn/a
Meas. Tech.ChEMBL_853390 (CHEMBL2155210)
IC50 910±n/a nM
Citation Prime, MEBrookfield, FACourtney, SMGaines, SMarston, RWIchihara, OLi, MVaidya, DWilliams, HPedret-Dunn, AReed, LSchaertl, SToledo-Sherman, LBeconi, MMacdonald, DMuņoz-Sanjuan, IDominguez, CWityak, J Irreversible 4-Aminopiperidine Transglutaminase 2 Inhibitors for Huntington's Disease. ACS Med Chem Lett3:731-735 (2012) 
 
Protein-glutamine gamma-glutamyltransferase K
Name:Protein-glutamine gamma-glutamyltransferase K
Type:Protein
Mol. Mass.:89778.63
Organism:Homo sapiens (Human)
Description:n/a
Residue:817
BDBM50392881
NameBDBM50392881
Synonyms:CHEMBL2152090
TypeSmall organic molecule
Emp. Form.C22H25N3O5S
Mol. Mass.443.516
SMILESC=CC(=O)NC1CCN(CC1)S(=O)(=O)c1ccc(NC(=O)OCc2ccccc2)cc1