Reaction Details
TargetProtein-glutamine gamma-glutamyltransferase 6
LigandBDBM50392906
Substrate/Competitorn/a
Meas. Tech.ChEMBL_853392 (CHEMBL2155212)
IC50 34000±n/a nM
Citation Prime, MEBrookfield, FACourtney, SMGaines, SMarston, RWIchihara, OLi, MVaidya, DWilliams, HPedret-Dunn, AReed, LSchaertl, SToledo-Sherman, LBeconi, MMacdonald, DMuņoz-Sanjuan, IDominguez, CWityak, J Irreversible 4-Aminopiperidine Transglutaminase 2 Inhibitors for Huntington's Disease. ACS Med Chem Lett3:731-735 (2012) 
 
Protein-glutamine gamma-glutamyltransferase 6
Name:Protein-glutamine gamma-glutamyltransferase 6
Type:Protein
Mol. Mass.:79319.01
Organism:Homo sapiens (Human)
Description:n/a
Residue:706
BDBM50392906
NameBDBM50392906
Synonyms:CHEMBL2152204
TypeSmall organic molecule
Emp. Form.C24H29N3O5S
Mol. Mass.471.569
SMILESCOc1ccc(CCNC(=O)c2ccc(cc2)S(=O)(=O)N2CCC(CC2)NC(=O)C=C)cc1