Reaction Details
TargetMitogen-activated protein kinase 8
LigandBDBM50392982
Substrate/Competitorn/a
Meas. Tech.ChEMBL_853501 (CHEMBL2153878)
IC50 44±n/a nM
Citation Haynes, NEScott, NRChen, LCJanson, CALi, JKLukacs, CMRailkar, ATozzo, EWhittard, TBrown, NFCheung, AW Identification of an Adamantyl Azaquinolone JNK Selective Inhibitor. ACS Med Chem Lett3:764-768 (2012) 
 
Mitogen-activated protein kinase 8
Name:Mitogen-activated protein kinase 8
Type:Enzyme
Mol. Mass.:48297.57
Organism:Homo sapiens (Human)
Description:JNK-1 was purchased from Upstate Cell Signaling Solutions (formerly Upstate Biotechnology).
Residue:427
BDBM50392982
NameBDBM50392982
Synonyms:CHEMBL2152382
TypeSmall organic molecule
Emp. Form.C27H23ClN2O5
Mol. Mass.490.935
SMILESCOC(=O)c1c(Cc2ccc(cc2)C(=O)NCCO)c(=O)c2ccc(Cl)cc2n1-c1ccccc1