Reaction Details
TargetMitogen-activated protein kinase 8
LigandBDBM50392990
Substrate/Competitorn/a
Meas. Tech.ChEMBL_853501 (CHEMBL2153878)
IC50 17±n/a nM
Citation Haynes, NEScott, NRChen, LCJanson, CALi, JKLukacs, CMRailkar, ATozzo, EWhittard, TBrown, NFCheung, AW Identification of an Adamantyl Azaquinolone JNK Selective Inhibitor. ACS Med Chem Lett3:764-768 (2012) 
 
Mitogen-activated protein kinase 8
Name:Mitogen-activated protein kinase 8
Type:Enzyme
Mol. Mass.:48297.57
Organism:Homo sapiens (Human)
Description:JNK-1 was purchased from Upstate Cell Signaling Solutions (formerly Upstate Biotechnology).
Residue:427
BDBM50392990
NameBDBM50392990
Synonyms:CHEMBL2152390
TypeSmall organic molecule
Emp. Form.C31H31N3O5
Mol. Mass.525.5949
SMILESCOC(=O)c1c(Cc2ccc(cc2)C(=O)N[C@H]2CC[C@H](O)CC2)c(=O)c2ccc(C)nc2n1-c1ccccc1