Reaction Details
TargetMitogen-activated protein kinase 8
LigandBDBM50392986
Substrate/Competitorn/a
Meas. Tech.ChEMBL_853502 (CHEMBL2153879)
EC50 9900±n/a nM
Citation Haynes, NEScott, NRChen, LCJanson, CALi, JKLukacs, CMRailkar, ATozzo, EWhittard, TBrown, NFCheung, AW Identification of an Adamantyl Azaquinolone JNK Selective Inhibitor. ACS Med Chem Lett3:764-768 (2012) 
 
Mitogen-activated protein kinase 8
Name:Mitogen-activated protein kinase 8
Type:Enzyme
Mol. Mass.:48297.57
Organism:Homo sapiens (Human)
Description:JNK-1 was purchased from Upstate Cell Signaling Solutions (formerly Upstate Biotechnology).
Residue:427
BDBM50392986
NameBDBM50392986
Synonyms:CHEMBL2152386
TypeSmall organic molecule
Emp. Form.C28H27N3O5
Mol. Mass.485.5311
SMILESCOC(=O)c1c(Cc2ccc(cc2)C(=O)NCC(C)(C)O)c(=O)c2cccnc2n1-c1ccccc1