Reaction Details
TargetMitogen-activated protein kinase 8
LigandBDBM50392992
Substrate/Competitorn/a
Meas. Tech.ChEMBL_853502 (CHEMBL2153879)
EC50 21900±n/a nM
Citation Haynes, NEScott, NRChen, LCJanson, CALi, JKLukacs, CMRailkar, ATozzo, EWhittard, TBrown, NFCheung, AW Identification of an Adamantyl Azaquinolone JNK Selective Inhibitor. ACS Med Chem Lett3:764-768 (2012) 
 
Mitogen-activated protein kinase 8
Name:Mitogen-activated protein kinase 8
Type:Enzyme
Mol. Mass.:48297.57
Organism:Homo sapiens (Human)
Description:JNK-1 was purchased from Upstate Cell Signaling Solutions (formerly Upstate Biotechnology).
Residue:427
BDBM50392992
NameBDBM50392992
Synonyms:CHEMBL2152392
TypeSmall organic molecule
Emp. Form.C34H34N4O4
Mol. Mass.562.6582
SMILESCOC(=O)c1c(Cc2ccc(cc2)C(=O)N[C@H]2[C@H]3C[C@H]4C[C@@H]2C[C@](N)(C4)C3)c(=O)c2cccnc2n1-c1ccccc1