Reaction Details
TargetSodium channel protein type 9 subunit alpha
LigandBDBM50393018
Substrate/Competitorn/a
Meas. Tech.ChEMBL_853578 (CHEMBL2153996)
Ki 59±n/a nM
Citation Blass, B Substituted pyridines as sodium channel blockers: patent highlight. ACS Med Chem Lett3:695-696 (2012) 
 
Sodium channel protein type 9 subunit alpha
Name:Sodium channel protein type 9 subunit alpha
Type:Protein
Mol. Mass.:226375.97
Organism:Homo sapiens (Human)
Description:Q15858
Residue:1988
BDBM50393018
NameBDBM50393018
Synonyms:CHEMBL2152683 | US9656959, Example 7
TypeSmall organic molecule
Emp. Form.C29H27FN4O3
Mol. Mass.498.5481
SMILESCC(C)C[C@H](NC(=O)c1ccccn1)C(=O)Nc1cccc(n1)-c1ccc(Oc2ccc(F)cc2)cc1