Reaction Details
TargetLeucine-rich repeat serine/threonine-protein kinase 2
LigandBDBM50393038
Substrate/Competitorn/a
Meas. Tech.ChEMBL_853591 (CHEMBL2154046)
Ki 0.3±n/a nM
Citation Abdel-Magid, AF Inhibitors of LRRK2 as Treatment for Parkinson's Disease: Patent Highlight. ACS Med Chem Lett3:701-702 (2012) 
 
Leucine-rich repeat serine/threonine-protein kinase 2
Name:Leucine-rich repeat serine/threonine-protein kinase 2
Type:Protein
Mol. Mass.:286113.20
Organism:Homo sapiens (Human)
Description:Q5S007
Residue:2527
BDBM50393038
NameBDBM50393038
Synonyms:CHEMBL2152707
TypeSmall organic molecule
Emp. Form.C18H21N5O
Mol. Mass.323.3922
SMILESCn1cc(C=Cc2[nH]nc3ccnc(OC4CCCCC4)c23)cn1