Reaction Details
TargetProstaglandin E synthase
LigandBDBM50393041
Substrate/Competitorn/a
Meas. Tech.ChEMBL_853592 (CHEMBL2154047)
IC50 890±n/a nM
Citation Abdel-Magid, AF Prostaglandin e2 synthase-1 inhibitors as potential treatment for osteoarthritis: patent highlight. ACS Med Chem Lett3:703-704 (2012) 
 
Prostaglandin E synthase
Name:Prostaglandin E synthase
Type:Protein
Mol. Mass.:17112.22
Organism:Homo sapiens (Human)
Description:n/a
Residue:152
BDBM50393041
NameBDBM50393041
Synonyms:CHEMBL2152711
TypeSmall organic molecule
Emp. Form.C15H17ClN4O2
Mol. Mass.320.774
SMILESCC(C)C(=O)NCc1ccc(Cl)c(c1)C(=O)Nc1ncc[nH]1