Reaction Details
TargetD-amino-acid oxidase
LigandBDBM50393050
Substrate/Competitorn/a
Meas. Tech.ChEMBL_853596 (CHEMBL2154051)
IC50 10000±n/a nM
Citation Berry, JFFerraris, DVDuvall, BHin, NRais, RAlt, JThomas, AGRojas, CHashimoto, KSlusher, BSTsukamoto, T Synthesis and SAR of 1-hydroxy-1H-benzo[d]imidazol-2(3H)-ones as Inhibitors of D-Amino Acid Oxidase. ACS Med Chem Lett3:839-843 (2012) 
 
D-amino-acid oxidase
Name:D-amino-acid oxidase
Type:Flavoprotein
Mol. Mass.:39338.01
Organism:Sus scrofa (pig)
Description:Homodimer.
Residue:347
BDBM50393050
NameBDBM50393050
Synonyms:CHEMBL2152739
TypeSmall organic molecule
Emp. Form.C10H10N2O2
Mol. Mass.190.1986
SMILESOn1c2cc3CCCc3cc2[nH]c1=O