Reaction Details
TargetBeta-secretase 1
LigandBDBM50393107
Substrate/Competitorn/a
Meas. Tech.ChEMBL_853652 (CHEMBL2154189)
IC50 0.590000±n/a nM
Citation Blass, B Compounds and Their Use as BACE Inhibitors: Patent Highlight. ACS Med Chem Lett3:875-876 (2012) 
 
Beta-secretase 1
Name:Beta-secretase 1
Type:Protein
Mol. Mass.:55755.10
Organism:Homo sapiens (Human)
Description:P56817
Residue:501
BDBM50393107
NameBDBM50393107
Synonyms:CHEMBL2152921
TypeSmall organic molecule
Emp. Form.C25H24ClFN4O
Mol. Mass.450.936
SMILESCO[C@H]1CC[C@@]2(Cc3ccc(cc3C22N=C(C)C(N)=N2)-c2cc(Cl)c(F)c(c2)C#N)CC1