Reaction Details
Target72 kDa type IV collagenase
LigandBDBM50393112
Substrate/Competitorn/a
Meas. Tech.ChEMBL_853829 (CHEMBL2154855)
IC50 87800±n/a nM
Citation Shengule, SRLoa-Kum-Cheung, WLParish, CRBlairvacq, MMeijer, LNakao, YKaruso, P A one-pot synthesis and biological activity of ageladine A and analogues. J Med Chem54:2492-503 (2011) 
 
72 kDa type IV collagenase
Name:72 kDa type IV collagenase
Type:Enzyme
Mol. Mass.:73870.36
Organism:Homo sapiens (Human)
Description: P08253
Residue:660
BDBM50393112
NameBDBM50393112
Synonyms:CHEMBL2153263
TypeSmall organic molecule
Emp. Form.C10H8N4S
Mol. Mass.216.262
SMILESNc1nc2c(nccc2[nH]1)-c1ccsc1